soft3/radio/audit/2026-10-10-workspace-gate/radio-final-gate2.results.txt

     Running unittests src/lib.rs (/Users/master/cyber/.stands/G3/_target/debug/deps/cyber_bao-4e9a37aad70d1df5)
test hash::tests::hash_size ... ok
test hash::tests::poseidon2_backend_basic ... ok
test hash::tests::poseidon2_backend_counter ... ok
test io::decode::tests::decode_empty ... ok
test hash::tests::poseidon2_backend_parent ... ok
test hash::tests::poseidon2_backend_root_differs ... ok
test io::decode::tests::decode_partial_block ... ok
test io::decode::tests::decode_single_block ... ok
test io::decode::tests::decode_wrong_root_fails ... ok
test io::decode::tests::decode_truncated_fails ... ok
test io::decode::tests::decode_tampered_data_fails ... ok
test io::encode::tests::encode_empty ... ok
test io::encode::tests::encode_deterministic ... ok
test io::encode::tests::encode_partial_block ... ok
test io::decode::tests::decode_two_blocks ... ok
test io::decode::tests::decode_four_blocks ... ok
test io::encode::tests::encode_single_block ... ok
test io::outboard::tests::outboard_empty ... ok
test io::encode::tests::encode_two_blocks ... ok
test io::fsm::tests::fsm_decode_two_blocks ... ok
test io::outboard::tests::outboard_deterministic ... ok
test io::outboard::tests::outboard_different_data_different_root ... ok
test io::outboard::tests::outboard_single_block ... ok
test io::outboard::tests::outboard_partial_last_block ... ok
test io::root_policy_tests::empty_and_single_leaf_preserve_absolute_counter_and_root ... ok
test io::encode::tests::encode_block_size_nonzero ... ok
test io::outboard::tests::outboard_four_blocks ... ok
test io::root_policy_tests::finalization_and_odd_promotion_are_independent_of_group_position ... ok
test io::encode::tests::encode_block_size_default ... ok
test io::pre_order::tests::post_order_mem_outboard_create ... ok
test io::pre_order::tests::pre_order_mem_outboard_create ... ok
test io::pre_order::tests::pre_order_outboard_roundtrip ... ok
test io::slice::tests::decode_slice_wrong_root_fails ... ok
test io::slice::tests::single_block_slice_roundtrip ... ok
test io::slice::tests::decode_slice_full_range_roundtrip ... ok
test io::slice::tests::decode_slice_partial_range ... ok
test io::outboard::tests::outboard_two_blocks ... ok
test io::fsm::tests::fsm_decode_with_range_filter ... ok
test io::pre_order::tests::post_order_can_validate_via_encode_ranges ... ok
test io::slice::tests::slice_full_range_matches_encode ... ok
test io::slice::tests::multi_range_slice_extract_and_verify ... ok
test io::pre_order::tests::pre_order_outboard_block_size_nonzero ... ok
test tree::tests::bao_tree_basic ... ok
test io::sync::tests::valid_ranges_empty_data ... ok
test io::sync::tests::valid_ranges_all_valid ... ok
test io::slice::tests::slice_partial_range_is_smaller ... ok
test io::sync::tests::encode_ranges_validated_full ... ok
test io::pre_order::tests::post_order_outboard_all_nodes_match_pre_order ... ok
test io::slice::tests::slice_root_hash_independent_of_range ... ok
test io::sync::tests::encode_then_valid_ranges_roundtrip ... ok
test tree::tests::bao_tree_large ... ok
test tree::tests::bao_tree_two_blocks ... ok
test tree::tests::block_size_bytes ... ok
test tree::tests::block_size_from_bytes ... ok
test tree::tests::post_order_two_blocks ... ok
test tree::tests::bao_tree_empty ... ok
test tree::tests::pre_order_four_blocks ... ok
test tree::tests::pre_order_single_block ... ok
test tree::tests::tree_node_children ... ok
test tree::tests::pre_order_two_blocks ... ok
test tree::tests::tree_node_is_leaf ... ok
test tree::tests::tree_node_chunk_range ... ok
test tree::tests::tree_node_level ... ok
test io::pre_order::tests::post_order_matches_pre_order_block_size_nonzero ... ok
test io::sync::tests::encode_ranges_block_size_nonzero ... ok
test io::slice::tests::slice_roundtrip_block_size_nonzero ... ok
test io::sync::tests::valid_ranges_block_size_nonzero ... ok
test io::decode::tests::roundtrip_various_sizes ... ok
test io::decode::tests::roundtrip_block_size_nonzero ... ok
test io::sync::tests::encode_ranges_partial_large_block ... ok
test io::decode::tests::roundtrip_block_size_default ... ok
test result: ok. 71 passed; 0 failed; 0 ignored; 0 measured; 0 filtered out; finished in 0.02s
     Running tests/root_policy.rs (/Users/master/cyber/.stands/G3/_target/debug/deps/root_policy-c74c1a1666e61006)
test published_empty_and_hello_tree_vectors_are_unchanged ... ok
test mixed_canonical_success_and_old_root_terminal_error ... ok
test fsm_literal_canonical_leaf_and_old_root_error ... ok
test literal_proof_rejects_the_old_internal_cv ... ok
test literal_proof_accepts_canonical_root ... ok
test literal_root_reaches_every_producer ... ok
test non_root_partial_and_odd_groups_verify_with_absolute_counters ... ok
test grouping_preserves_fixed_tree_at_boundaries ... ok
test result: ok. 8 passed; 0 failed; 0 ignored; 0 measured; 0 filtered out; finished in 0.13s
     Running tests/slice_traversal.rs (/Users/master/cyber/.stands/G3/_target/debug/deps/slice_traversal-f469877b30ccbe1e)
test grouped_single_block_has_canonical_root_finalization ... ok
test right_proof_rejects_corruption_and_truncation ... ok
test literal_partial_fifth_leaf_and_mixed_outside_query ... ok
test literal_right_subtree_is_authenticated ... ok
test multiblock_empty_and_outside_queries_preserve_existing_behavior ... ok
test literal_sparse_leaves ... ok
test literal_left_and_full_controls ... ok
test literal_grouped_right_blocks ... ok
test literal_nested_right_subtree ... ok
test result: ok. 9 passed; 0 failed; 0 ignored; 0 measured; 0 filtered out; finished in 0.01s
     Running unittests src/lib.rs (/Users/master/cyber/.stands/G3/_target/debug/deps/radio-e839eb86c8b7e68c)
test address_lookup::memory::tests::test_provenance ... ok
test address_lookup::test_dns_pkarr::dns_resolve ... ok
test address_lookup::test_dns_pkarr::pkarr_publish_dns_resolve ... ok
test address_lookup::memory::tests::test_basic ... ok
test address_lookup::test_dns_pkarr::pkarr_publish_dns_address_lookup ... ok
test endpoint::connection::tests::test_0rtt ... ok
test address_lookup::tests::address_lookup_combined_with_empty_and_right ... ok
test address_lookup::tests::address_lookup_simple_shared_with_arc ... ok
test endpoint::tests::connect_via_relay_becomes_direct_and_sends_direct ... ignored, flaky
test endpoint::connection::tests::test_0rtt_after_server_restart ... ok
test address_lookup::tests::address_lookup_simple_shared ... ok
test endpoint::connection::tests::test_0rtt_non_consecutive ... ok
test endpoint::tests::endpoint_bidi_send_recv ... ok
test dns::tests::test_dns_lookup_ipv4_ipv6 ... ok
test endpoint::tests::endpoint_connect_close ... ok
test endpoint::tests::connect_multiple_alpn_negotiated ... ok
test endpoint::tests::endpoint_two_direct_only ... ok
test address_lookup::mdns::tests::run_in_isolation::test_service_names ... FAILED
test address_lookup::mdns::tests::run_in_isolation::mdns_publish_resolve ... FAILED
test endpoint::tests::metrics_smoke ... ok
test address_lookup::tests::address_lookup_with_wrong_existing_addr ... ok
test endpoint::tests::test_bind_addr_badport ... ok
test endpoint::tests::test_bind_addr_badport_default_notrequired ... ok
test endpoint::tests::test_bind_addr_badport_notrequired ... ok
test endpoint::tests::test_bind_addr_badport_notrequired_no_other_transports ... ok
test endpoint::tests::test_bind_addr_clear ... ok
test endpoint::tests::test_bind_addr_default ... ok
test endpoint::tests::test_bind_addr_no_clear ... ok
test endpoint::tests::test_bind_addr_nonzero_prefix ... ok
test endpoint::tests::test_bind_addr_prefix_len_0_not_default ... ok
test endpoint::tests::test_closed_endpoint_behaviour ... ok
test endpoint::tests::test_closed_endpoint_polled_accept_fut ... ok
test endpoint::tests::test_closed_endpoint_unpolled_accept_fut ... ok
test endpoint::tests::test_connect_self ... ok
test address_lookup::tests::address_lookup_combined_with_empty_and_wrong ... ok
test endpoint::tests::endpoint_two_relay_only_no_ip ... ok
test endpoint::tests::test_direct_addresses_no_qad_relay ... ok
test metrics::tests::test_serde ... ok
test net_report::probes::tests::test_initial_probeplan ... ok
test net_report::probes::tests::test_initial_probeplan_some_protocols ... ok
test endpoint::tests::test_custom_relay ... ok
test net_report::reportgen::tests::test_measure_https_latency ... ok
test net_report::tests::test_add_report_history_set_preferred_relay ... ok
test net_report::reportgen::tests::test_qad_probe_v4 ... ok
test endpoint::tests::same_endpoint_id_relay ... ok
test protocol::tests::test_limiter_hook ... ok
test net_report::tests::test_basic ... ok
test address_lookup::mdns::tests::run_in_isolation::non_advertising_endpoint_not_discovered ... FAILED
test socket::remote_map::remote_state::path_state::tests::test_abandoned_path ... ok
test socket::remote_map::remote_state::path_state::tests::test_insert_open_path ... ok
test socket::remote_map::remote_state::path_state::tests::test_prune_all_paths_failed ... ok
test socket::remote_map::remote_state::path_state::tests::test_prune_at_max_paths_no_prunable ... ok
test socket::remote_map::remote_state::path_state::tests::test_prune_failed_holepunch ... ok
test socket::remote_map::remote_state::path_state::tests::test_prune_keeps_most_recent_inactive ... ok
test protocol::tests::test_graceful_shutdown ... ok
test socket::remote_map::remote_state::path_state::tests::test_prune_mixed_must_and_can_prune ... ok
test socket::remote_map::remote_state::path_state::tests::test_prune_preserves_never_dialed ... ok
test socket::remote_map::remote_state::path_state::tests::test_prune_under_max_paths ... ok
test socket::remote_map::remote_state::tests::test_available_wins_over_backup_regardless_of_rtt ... ok
test socket::remote_map::remote_state::tests::test_empty_paths_returns_none ... ok
test socket::remote_map::remote_state::tests::test_ipv6_wins_over_ipv4_within_bias ... ok
test socket::remote_map::remote_state::tests::test_no_current_path_selects_best ... ok
test socket::remote_map::remote_state::tests::test_same_category_only_switches_with_significant_rtt_diff ... ok
test socket::remote_map::remote_state::path_state::tests::test_prune_non_ip_paths_not_counted ... ok
test protocol::tests::test_shutdown ... ok
test socket::tests::test_direct_addresses ... ok
test protocol::tests::test_limiter_router ... ok
test socket::tests::test_try_send_no_send_addr ... ok
test endpoint::tests::connect_multi_time ... ok
test endpoint::tests::watch_net_report ... ok
test socket::tests::test_regression_network_change_rebind_wakes_connection_driver ... ok
test socket::tests::test_two_devices_setup_teardown ... ok
test socket::transports::ip::tests::test_bind_sorting ... ok
test socket::transports::relay::actor::tests::test_active_relay_inactive ... ok
test socket::transports::relay::actor::tests::test_active_relay_reconnect ... ok
test socket::transports::relay::actor::tests::test_ping_tracker ... ok
test socket::transports::relay::tests::test_relay_datagram_queue ... ok
test test_utils::pkarr_dns_state::tests::test_endpoint_id_from_domain_name ... ok
test tls::name::tests::test_roundtrip ... ok
test tls::name::tests::test_snapshot ... ok
test util::tests::test_maybefuture_poll_after_use ... ok
test address_lookup::tests::address_lookup_combined_wrong_only ... ok
test address_lookup::mdns::tests::run_in_isolation::mdns_subscribe ... ok
test endpoint::tests::endpoint_send_relay ... ok
test endpoint::tests::endpoint_relay_map_change ... ok
test endpoint::connection::tests::test_paths_watcher ... ok
test endpoint::tests::graceful_close ... ok
test endpoint::tests::endpoint_two_relay_only_becomes_direct ... ok
test endpoint::tests::endpoint_two_direct_add_relay ... ok
test socket::tests::test_try_send_no_udp_addr_or_relay_url ... ok
test socket::tests::test_two_devices_roundtrip_network_change_a_and_b ... ok
test address_lookup::mdns::tests::run_in_isolation::mdns_publish_expire ... ok
test socket::tests::test_two_devices_roundtrip_network_change_only_a ... ok
test socket::tests::test_two_devices_roundtrip_quinn_large ... ok
test socket::tests::test_two_devices_roundtrip_quinn_small ... ok
test endpoint::tests::endpoint_relay_connect_loop ... ok
test result: FAILED. 92 passed; 3 failed; 1 ignored; 0 measured; 0 filtered out; finished in 15.97s
error: test failed, to rerun pass `-p cyber-radio --lib`
real 16.88
exit=101

Graph