Compiling unicode-ident v1.0.22
Compiling libc v0.2.180
Compiling serde_core v1.0.228
Compiling portable-atomic v1.13.1
Compiling anyhow v1.0.101
Compiling num-traits v0.2.19
Compiling typenum v1.19.0
Compiling icu_properties_data v2.1.2
Compiling icu_normalizer_data v2.1.1
Compiling unicode-segmentation v1.12.0
Compiling time-macros v0.2.27
Compiling zmij v1.0.19
Compiling either v1.15.0
Compiling crossbeam-utils v0.8.21
Compiling httparse v1.10.1
Compiling byteorder v1.5.0
Compiling proc-macro2 v1.0.106
Compiling indexmap v2.13.0
Compiling hash32 v0.2.1
Compiling minimal-lexical v0.2.1
Compiling objc2 v0.6.3
Compiling libm v0.2.16
Compiling aho-corasick v1.1.4
Compiling nom v7.1.3
Compiling spin v0.9.8
Compiling convert_case v0.10.0
Compiling crc-catalog v2.4.0
Compiling once_cell v1.21.3
Compiling crc v3.4.0
Compiling crossbeam-epoch v0.9.18
Compiling tracing-core v0.1.36
Compiling quote v1.0.44
Compiling flume v0.11.1
Compiling errno v0.3.14
Compiling socket2 v0.6.2
Compiling syn v2.0.114
Compiling signal-hook-registry v1.4.8
Compiling mio v1.1.1
Compiling getrandom v0.3.4
Compiling getrandom v0.2.17
Compiling num_threads v0.1.7
Compiling rand_core v0.9.5
Compiling num-integer v0.1.46
Compiling cpufeatures v0.2.17
Compiling ring v0.17.14
Compiling socket2 v0.5.10
Compiling time v0.3.47
Compiling security-framework-sys v2.15.0
Compiling num-bigint v0.4.6
Compiling core-foundation v0.10.1
Compiling syn v1.0.109
Compiling toml_edit v0.23.10+spec-1.0.0
Compiling hybrid-array v0.4.7
Compiling uuid v1.20.0
Compiling crossbeam-channel v0.5.15
Compiling security-framework v3.5.1
Compiling tracing-log v0.2.0
Compiling regex-automata v0.4.14
Compiling crypto-common v0.2.0
Compiling block-buffer v0.11.0
Compiling proc-macro-crate v3.4.0
Compiling arc-swap v1.8.1
Compiling dispatch2 v0.3.0
Compiling block2 v0.6.2
Compiling simdutf8 v0.1.5
Compiling hashbrown v0.14.5
Compiling chrono v0.4.43
Compiling winnow v0.7.14
Compiling objc2-core-foundation v0.3.2
Compiling digest v0.11.0-rc.10
Compiling rusticata-macros v4.1.0
Compiling seize v0.5.1
Compiling sha2 v0.11.0-rc.2
Compiling mime v0.3.17
Compiling reloadable-core v0.1.0
Compiling toml_writer v1.0.6+spec-1.1.0
Compiling papaya v0.2.3
Compiling rustix v1.1.3
Compiling matchit v0.8.4
Compiling sha1 v0.11.0-rc.4
Compiling cyber-radio v0.1.0 (/private/tmp/radio-export-pairs.FbuGlp/candidate/radio/iroh)
Compiling blake3 v1.8.3
Compiling serde_json v1.0.149
Compiling serde_bytes v0.11.19
Compiling yasna v0.5.2
Compiling toml_datetime v0.7.5+spec-1.1.0
Compiling serde_spanned v1.0.4
Compiling serde_path_to_error v0.1.20
Compiling objc2-security v0.3.2
Compiling toml_parser v1.0.6+spec-1.1.0
Compiling syn-mid v0.5.4
Compiling tempfile v3.24.0
Compiling itertools v0.14.0
Compiling transpose v0.2.3
Compiling generic-array v0.14.7
Compiling redb v2.6.3
Compiling objc2-system-configuration v0.3.2
Compiling wait-timeout v0.2.1
Compiling rand_xorshift v0.4.0
Compiling rusty-fork v0.3.1
Compiling crossbeam-deque v0.8.6
Compiling positioned-io v0.3.5
Compiling core2 v0.4.0
Compiling unsigned-varint v0.8.0
Compiling unicode-width v0.2.2
Compiling concurrent-queue v2.5.0
Compiling const-str v0.4.3
Compiling toml v0.9.11+spec-1.1.0
Compiling rayon-core v1.13.0
Compiling maybe-std v0.1.2
Compiling humantime v2.3.0
Compiling wrapper v0.1.1
Compiling event-listener v5.4.1
Compiling rand_core v0.6.4
Compiling itertools v0.13.0
Compiling ufotofu_queues v0.5.0
Compiling base-x v0.2.11
Compiling block-buffer v0.10.4
Compiling matchers v0.2.0
Compiling crypto-common v0.1.7
Compiling ufotofu v0.4.3
Compiling event-listener-strategy v0.5.4
Compiling wasm-bindgen-shared v0.2.108
Compiling iroh-blobs v0.98.0 (/private/tmp/radio-export-pairs.FbuGlp/candidate/radio/iroh-blobs)
Compiling signature v2.2.0
Compiling rayon v1.11.0
Compiling digest v0.10.7
Compiling lz4-sys v1.11.1+lz4-1.10.0
Compiling async-channel v2.5.0
Compiling quanta v0.12.6
Compiling proc-macro-error-attr v0.4.12
Compiling data-encoding-macro-internal v0.1.17
Compiling spinning_top v0.3.0
Compiling sha2 v0.10.9
Compiling synstructure v0.13.2
Compiling darling_core v0.20.11
Compiling darling_core v0.21.3
Compiling proc-macro-error v0.4.12
Compiling wasm-bindgen-macro-support v0.2.108
Compiling web-time v1.1.0
Compiling futures-timer v3.0.3
Compiling nonempty v0.7.0
Compiling data-encoding-macro v0.1.19
Compiling ciborium-io v0.2.2
Compiling adler2 v2.0.1
Compiling gimli v0.32.3
Compiling struct_iterable_internal v0.1.1
Compiling plotters-backend v0.3.7
Compiling nonzero_ext v0.3.0
Compiling miniz_oxide v0.8.9
Compiling lz4 v1.28.1
Compiling plotters-svg v0.3.7
Compiling object v0.37.3
Compiling camino v1.2.2
Compiling regex v1.12.3
Compiling semver v1.0.27
Compiling genawaiter-proc-macro v0.99.1
Compiling dirs-sys-next v0.1.2
Compiling linked-hash-map v0.5.6
Compiling cast v0.3.0
Compiling rustc-demangle v0.1.27
Compiling ttl_cache v0.5.1
Compiling compression-codecs v0.4.37
Compiling serde_derive v1.0.228
Compiling tracing-attributes v0.1.31
Compiling tokio-macros v2.6.0
Compiling zeroize_derive v1.4.3
Compiling zerocopy-derive v0.8.39
Compiling futures-macro v0.3.31
Compiling displaydoc v0.2.5
Compiling zerofrom-derive v0.1.6
Compiling zeroize v1.8.2
Compiling yoke-derive v0.8.1
Compiling zerovec-derive v0.11.2
Compiling thiserror-impl v2.0.18
Compiling futures-util v0.3.31
Compiling derive_more-impl v2.1.1
Compiling darling_macro v0.20.11
Compiling n0-error-macros v0.1.3
Compiling tracing v0.1.44
Compiling spez v0.1.2
Compiling zerocopy v0.8.39
Compiling pin-project-internal v1.1.10
Compiling darling v0.20.11
Compiling darling_macro v0.21.3
Compiling zerofrom v0.1.6
Compiling n0-error v0.1.3
Compiling async-trait v0.1.89
Compiling thiserror v2.0.18
Compiling postcard-derive v0.2.2
Compiling darling v0.21.3
Compiling serde v1.0.228
Compiling pin-project v1.1.10
Compiling strum_macros v0.27.2
Compiling asn1-rs-impl v0.2.0
Compiling asn1-rs-derive v0.6.0
Compiling enum-assoc v1.3.0
Compiling enum-as-inner v0.6.1
Compiling iroh-metrics-derive v0.4.1
Compiling num_enum_derive v0.7.5
Compiling clap_derive v4.5.55
Compiling axum-macros v0.5.0
Compiling strum v0.27.2
Compiling derive_more v2.1.1
Compiling num_enum v0.7.5
Compiling rustls-pki-types v1.14.0
Compiling rustls-webpki v0.103.9
Compiling der v0.8.0-rc.10
Compiling webpki-roots v1.0.6
Compiling clap v4.5.57
Compiling rustls v0.23.36
Compiling cyber-radio-quinn-udp v0.1.0 (/private/tmp/radio-export-pairs.FbuGlp/candidate/radio/quinn/quinn-udp)
Compiling spki v0.8.0-rc.4
Compiling iroh-quinn-udp v0.8.0
Compiling pkcs8 v0.11.0-rc.10
Compiling rustls-cert-read v0.3.0
Compiling ref-cast-impl v1.0.25
Compiling genawaiter v0.99.1
Compiling derive_builder_core v0.20.2
Compiling ref-cast v1.0.25
Compiling yoke v0.8.1
Compiling derive_builder_macro v0.20.2
Compiling derive_builder v0.20.2
Compiling futures-executor v0.3.31
Compiling cobs v0.3.0
Compiling futures v0.3.31
Compiling asn1-rs v0.7.1
Compiling irpc-derive v0.9.0
Compiling thiserror-impl v1.0.69
Compiling serde_with_macros v3.16.1
Compiling ppv-lite86 v0.2.21
Compiling serde_with v3.16.1
Compiling rustls-platform-verifier v0.6.2
Compiling rand_chacha v0.9.0
Compiling smallvec v1.15.1
Compiling bytes v1.11.1
Compiling parking_lot_core v0.9.12
Compiling rand v0.9.2
Compiling ipnet v2.11.0
Compiling parking_lot v0.12.5
Compiling tokio v1.49.0
Compiling http v1.4.0
Compiling curve25519-dalek v5.0.0-pre.1
Compiling ed25519 v3.0.0-rc.4
Compiling heapless v0.7.17
Compiling serde_urlencoded v0.7.1
Compiling postcard v1.1.3
Compiling fastbloom v0.14.1
Compiling http-body v1.0.1
Compiling ed25519-dalek v3.0.0-pre.1
Compiling serde_bencode v0.2.4
Compiling plist v1.8.0
Compiling http-body-util v0.1.3
Compiling ntimestamp v1.0.0
Compiling mainline v6.0.1
Compiling moka v0.12.13
Compiling tracing-subscriber v0.3.22
Compiling dashmap v6.1.0
Compiling cyber-hemera v0.3.1 (/private/tmp/radio-export-pairs.FbuGlp/candidate/hemera/rs)
Compiling netdev v0.40.0
Compiling axum-core v0.5.6
Compiling ahash v0.8.12
Compiling inplace-vec-builder v0.1.1
Compiling p3-util v0.4.2
Compiling futures-concurrency v7.7.1
Compiling p3-field v0.4.2
Compiling nested_enum_utils v0.2.3
Compiling thiserror v1.0.69
Compiling proptest v1.10.0
Compiling multihash v0.19.3
Compiling match-lookup v0.1.2
Compiling strum_macros v0.26.4
Compiling p3-matrix v0.4.2
Compiling p3-symmetric v0.4.2
Compiling base256emoji v1.0.2
Compiling humantime-serde v1.1.1
Compiling serde-error v0.1.3
Compiling p3-dft v0.4.2
Compiling crossterm v0.29.0
Compiling range-collections v0.4.6
Compiling p3-mds v0.4.2
Compiling n0-tracing-test-macro v0.3.0
Compiling structmeta-derive v0.3.0
Compiling p3-poseidon2 v0.4.2
Compiling strum v0.26.3
Compiling p3-monty-31 v0.4.2
Compiling syncify v0.1.0
Compiling willow-encoding v0.1.0 (https://github.com/n0-computer/willow-rs.git?branch=main#12d29767)
Compiling structmeta v0.3.0
Compiling p3-challenger v0.4.2
Compiling n0-tracing-test v0.3.0
Compiling comfy-table v7.2.2
Compiling half v2.7.1
Compiling zerocopy-derive v0.7.35
Compiling structmeta-derive v0.2.0
Compiling ciborium-ll v0.2.2
Compiling p3-goldilocks v0.4.2
Compiling zerocopy v0.7.35
Compiling governor v0.10.4
Compiling structmeta v0.2.0
Compiling prefix-trie v0.7.0
Compiling ed25519 v2.2.3
Compiling cbor4ii v0.2.14
Compiling curve25519-dalek v4.1.3
Compiling cargo-platform v0.1.9
Compiling rand_chacha v0.3.1
Compiling wasm-bindgen-macro v0.2.108
Compiling addr2line v0.25.1
Compiling derive_more-impl v1.0.0
Compiling zerovec v0.11.5
Compiling zerotrie v0.2.3
Compiling vergen-lib v9.1.0
Compiling vergen-lib v0.1.6
Compiling vergen v9.1.0
Compiling vergen-gitcl v1.0.8
Compiling multihash-derive-impl v0.1.2
Compiling struct_iterable_derive v0.1.0
Compiling cyber-radio-relay v0.1.0 (/private/tmp/radio-export-pairs.FbuGlp/candidate/radio/iroh-relay)
Compiling iroh-relay v0.96.1
Compiling iroh-dns-server v0.96.1 (/private/tmp/radio-export-pairs.FbuGlp/candidate/radio/iroh-dns-server)
Compiling tracing-test-macro v0.2.6
Compiling tracing-test v0.2.6
Compiling n0-qlog v0.1.0
Compiling forwarded-header-value v0.1.1
Compiling struct_iterable v0.1.1
Compiling multibase v0.9.2
Compiling cid v0.11.1
Compiling ipld-core v0.4.3
Compiling tokio-util v0.7.18
Compiling tokio-rustls v0.26.4
Compiling h2 v0.4.13
Compiling tower v0.5.3
Compiling n0-future v0.3.2
Compiling tokio-stream v0.1.18
Compiling tower-http v0.6.8
Compiling async-compat v0.2.5
Compiling n0-watcher v0.6.1
Compiling tokio-websockets v0.12.3
Compiling fs-err v3.2.2
Compiling reloadable-state v0.1.0
Compiling backon v1.6.0
Compiling cyber-radio-quinn-proto v0.1.0 (/private/tmp/radio-export-pairs.FbuGlp/candidate/radio/quinn/quinn-proto)
Compiling iroh-quinn-proto v0.15.1
Compiling rustls-cert-reloadable-resolver v0.7.1
Compiling rustls-cert-file-reader v0.4.2
Compiling cyber-radio-netwatch v0.1.0 (/private/tmp/radio-export-pairs.FbuGlp/candidate/radio/nettools/netwatch)
Compiling acto v0.8.0
Compiling iroh-io v0.6.2
Compiling netwatch v0.14.0
Compiling bao-tree v0.16.0
Compiling cyber-bao v0.1.0 (/private/tmp/radio-export-pairs.FbuGlp/candidate/radio/cyber-bao)
Compiling derive-ex v0.1.8
Compiling willow-data-model v0.1.0 (https://github.com/n0-computer/willow-rs.git?branch=main#12d29767)
Compiling meadowcap v0.1.0 (https://github.com/n0-computer/willow-rs.git?branch=main#12d29767)
Compiling tinystr v0.8.2
Compiling potential_utf v0.1.4
Compiling test-strategy v0.3.1
Compiling willow-store v0.1.0 (https://github.com/n0-computer/willow-store.git?branch=main#b1c1bb90)
Compiling icu_locale_core v2.1.1
Compiling icu_collections v2.1.1
Compiling serde_ipld_dagcbor v0.6.4
Compiling multihash-derive v0.9.1
Compiling derive_more v1.0.0
Compiling backtrace v0.3.76
Compiling test-strategy v0.4.5
warning: cyber-radio-relay@0.1.0: not within a suitable 'git' worktree!
warning: cyber-radio-relay@0.1.0: VERGEN_GIT_SHA set to default
Compiling wasm-bindgen v0.2.108
Compiling icu_provider v2.1.1
Compiling rand v0.8.5
Compiling hyper v1.8.1
Compiling cargo_metadata v0.14.2
Compiling icu_properties v2.1.2
Compiling icu_normalizer v2.1.1
Compiling ed25519-dalek v2.2.0
Compiling cyber-hemera v0.1.2
Compiling ciborium v0.2.2
Compiling tinytemplate v1.2.1
Compiling serde_test v1.0.177
Compiling criterion-plot v0.6.0
warning: iroh-dns-server@0.96.1: not within a suitable 'git' worktree!
warning: iroh-dns-server@0.96.1: VERGEN_GIT_SHA set to default
Compiling dirs-next v2.0.0
Compiling plotters v0.3.7
Compiling redb v3.1.0
Compiling hyper-util v0.1.20
Compiling nested_enum_utils v0.1.0
Compiling console v0.16.2
Compiling hdrhistogram v7.5.4
Compiling sysinfo v0.26.9
Compiling idna_adapter v1.2.1
Compiling idna v1.1.0
Compiling base64-url v3.0.2
Compiling whoami v1.6.1
Compiling anes v0.1.6
Compiling url v2.5.8
Compiling oorandom v11.1.5
Compiling unsigned-varint v0.7.2
Compiling yansi v1.0.1
Compiling unit-prefix v0.5.2
Compiling diff v0.1.13
Compiling indicatif v0.18.3
Compiling pretty_assertions v1.4.1
Compiling testdir v0.7.3
Compiling iroh-car v0.5.0 (/private/tmp/radio-export-pairs.FbuGlp/candidate/radio/iroh-car)
Compiling async-compression v0.4.40
Compiling criterion v0.7.0
Compiling multihash-codetable v0.1.4
Compiling iroh-test v0.31.0
Compiling serde-byte-array v0.1.2
Compiling hickory-proto v0.25.2
Compiling attohttpc v0.30.1
Compiling cyber-radio-base v0.1.1 (/private/tmp/radio-export-pairs.FbuGlp/candidate/radio/iroh-base)
Compiling iroh-base v0.96.1
Compiling iroh-base v0.95.1
Compiling parse-size v1.1.0
Compiling hyper-rustls v0.27.7
Compiling axum-server v0.8.0
Compiling axum v0.8.8
Compiling igd-next v0.16.2
Compiling iroh-tickets v0.3.0
Compiling reqwest v0.12.28
Compiling iroh-tickets v0.2.0
Compiling console_error_panic_hook v0.1.7
Compiling iroh-metrics v0.38.2
Compiling pkarr v5.0.2
Compiling oid-registry v0.8.1
Compiling der-parser v10.0.0
Compiling x509-parser v0.18.1
Compiling rcgen v0.14.7
Compiling cyber-radio-portmapper v0.1.0 (/private/tmp/radio-export-pairs.FbuGlp/candidate/radio/nettools/portmapper)
Compiling portmapper v0.14.0
Compiling tokio-rustls-acme v0.9.0
Compiling iroh-quinn v0.16.1
Compiling cyber-radio-quinn v0.1.0 (/private/tmp/radio-export-pairs.FbuGlp/candidate/radio/quinn/quinn)
Compiling tower_governor v0.8.0
Compiling irpc v0.12.0
Compiling hickory-resolver v0.25.2
Compiling swarm-discovery v0.5.0
Compiling hickory-server v0.25.2
Compiling iroh v0.96.1
Compiling iroh-blobs v0.98.0
Compiling iroh-gossip v0.96.0
Compiling iroh-gossip v0.96.0 (/private/tmp/radio-export-pairs.FbuGlp/candidate/radio/iroh-gossip)
Compiling iroh-docs v0.96.0 (/private/tmp/radio-export-pairs.FbuGlp/candidate/radio/iroh-docs)
Compiling iroh-bench v0.96.1 (/private/tmp/radio-export-pairs.FbuGlp/candidate/radio/iroh/bench)
Compiling iroh-willow v0.28.0 (/private/tmp/radio-export-pairs.FbuGlp/candidate/radio/iroh-willow)
error[E0433]: cannot find module or crate `radio` in this scope
--> iroh/bench/src/iroh.rs:7:5
|
7 | use radio::{
| ^^^^^ use of unresolved module or unlinked crate `radio`
|
= help: if you wanted to use a crate named `radio`, use `cargo add radio` to add it to your `Cargo.toml`
error[E0432]: unresolved import `radio`
--> iroh/bench/src/iroh.rs:7:5
|
7 | use radio::{
| ^^^^^ use of unresolved module or unlinked crate `radio`
|
= help: if you wanted to use a crate named `radio`, use `cargo add radio` to add it to your `Cargo.toml`
error[E0433]: cannot find `radio` in the crate root
--> iroh/bench/src/lib.rs:82:12
|
82 | Iroh(::radio::Endpoint),
| ^^^^^ could not find `radio` in the list of imported crates
error[E0433]: cannot find `radio` in the crate root
--> iroh/bench/src/lib.rs:103:12
|
103 | Iroh(::radio::endpoint::Connection),
| ^^^^^ could not find `radio` in the list of imported crates
error[E0433]: cannot find module or crate `radio` in this scope
--> iroh/bench/src/lib.rs:216:21
|
216 | radio::handle_client_stream(connection, opt.upload_size, opt.read_unordered)
| ^^^^^ use of unresolved module or unlinked crate `radio`
|
= help: if you wanted to use a crate named `radio`, use `cargo add radio` to add it to your `Cargo.toml`
Some errors have detailed explanations: E0432, E0433.
For more information about an error, try `rustc --explain E0432`.
error: could not compile `iroh-bench` (lib) due to 5 previous errors
warning: build failed, waiting for other jobs to finish...
error[E0053]: method `find_providers` has an incompatible type for trait
--> iroh-docs/src/engine/live.rs:906:54
|
906 | fn find_providers(&self, hash: HashAndFormat) -> n0_future::stream::Boxed<EndpointId> {
| ^^^^^^^^^^^^^^^^^^^^^^^^^^^^^^^^^^^^ expected `iroh_base::key::PublicKey`, found `radio::PublicKey`
|
= note: expected signature `fn(&ProviderNodes, HashAndFormat) -> Pin<Box<(dyn futures_util::Stream<Item = iroh_base::key::PublicKey> + std::marker::Send + 'static)>>`
found signature `fn(&ProviderNodes, HashAndFormat) -> Pin<Box<(dyn futures_util::Stream<Item = radio::PublicKey> + std::marker::Send + 'static)>>`
help: change the output type to match the trait
|
906 - fn find_providers(&self, hash: HashAndFormat) -> n0_future::stream::Boxed<EndpointId> {
906 + fn find_providers(&self, hash: HashAndFormat) -> Pin<Box<(dyn futures_util::Stream<Item = iroh_base::key::PublicKey> + std::marker::Send + 'static)>> {
|
error[E0308]: mismatched types
--> iroh-docs/src/protocol.rs:106:43
|
106 | let downloader = blobs.downloader(&endpoint);
| ---------- ^^^^^^^^^ expected `iroh::endpoint::Endpoint`, found `radio::Endpoint`
| |
| arguments to this method are incorrect
|
= note: `radio::Endpoint` and `iroh::endpoint::Endpoint` have similar names, but are actually distinct types
note: `radio::Endpoint` is defined in crate `radio`
--> iroh/src/endpoint.rs:677:1
|
677 | pub struct Endpoint {
| ^^^^^^^^^^^^^^^^^^^
note: `iroh::endpoint::Endpoint` is defined in crate `iroh`
--> /Users/master/.cargo/registry/src/index.crates.io-1949cf8c6b5b557f/iroh-0.96.1/src/endpoint.rs:680:1
|
680 | pub struct Endpoint {
| ^^^^^^^^^^^^^^^^^^^
note: method defined here
--> /Users/master/.cargo/registry/src/index.crates.io-1949cf8c6b5b557f/iroh-blobs-0.98.0/src/api.rs:245:12
|
245 | pub fn downloader(&self, endpoint: &Endpoint) -> downloader::Downloader {
| ^^^^^^^^^^
error[E0308]: mismatched types
--> iroh-docs/src/engine/gossip.rs:51:55
|
51 | entry.get_mut().sender.join_peers(bootstrap).await?;
| ---------- ^^^^^^^^^ expected `iroh_base::key::PublicKey`, found `radio::PublicKey`
| |
| arguments to this method are incorrect
|
note: there are multiple different versions of crate `iroh_base` in the dependency graph
--> /Users/master/.cargo/registry/src/index.crates.io-1949cf8c6b5b557f/iroh-base-0.96.1/src/key.rs:24:1
|
24 | pub struct PublicKey(CompressedEdwardsY);
| ^^^^^^^^^^^^^^^^^^^^ this is the expected type
|
::: iroh-base/src/key.rs:24:1
|
24 | pub struct PublicKey(CompressedEdwardsY);
| -------------------- this is the found type
= help: you can use `cargo tree` to explore your dependency tree
note: method defined here
--> /Users/master/.cargo/registry/src/index.crates.io-1949cf8c6b5b557f/iroh-gossip-0.96.0/src/api.rs:192:18
|
192 | pub async fn join_peers(&self, peers: Vec<EndpointId>) -> Result<(), ApiError> {
| ^^^^^^^^^^
error[E0271]: type mismatch resolving `<Vec<PublicKey> as IntoIterator>::Item == PublicKey`
--> iroh-docs/src/engine/gossip.rs:57:88
|
57 | .subscribe_with_opts(namespace.into(), JoinOptions::with_bootstrap(bootstrap))
| --------------------------- ^^^^^^^^^ expected `iroh_base::key::PublicKey`, found `radio::PublicKey`
| |
| required by a bound introduced by this call
|
note: there are multiple different versions of crate `iroh_base` in the dependency graph
--> /Users/master/.cargo/registry/src/index.crates.io-1949cf8c6b5b557f/iroh-base-0.96.1/src/key.rs:24:1
|
24 | pub struct PublicKey(CompressedEdwardsY);
| ^^^^^^^^^^^^^^^^^^^^ this is the expected type
|
::: iroh-base/src/key.rs:24:1
|
24 | pub struct PublicKey(CompressedEdwardsY);
| -------------------- this is the found type
= help: you can use `cargo tree` to explore your dependency tree
note: required by a bound in `JoinOptions::with_bootstrap`
--> /Users/master/.cargo/registry/src/index.crates.io-1949cf8c6b5b557f/iroh-gossip-0.96.0/src/api.rs:403:56
|
403 | pub fn with_bootstrap(endpoints: impl IntoIterator<Item = EndpointId>) -> Self {
| ^^^^^^^^^^^^^^^^^ required by this bound in `JoinOptions::with_bootstrap`
error[E0308]: mismatched types
--> iroh-docs/src/engine/gossip.rs:145:56
|
145 | .send(ToLiveActor::NeighborUp { namespace, peer })
| ^^^^ expected `radio::PublicKey`, found `iroh_base::key::PublicKey`
|
note: there are multiple different versions of crate `iroh_base` in the dependency graph
--> iroh-base/src/key.rs:24:1
|
24 | pub struct PublicKey(CompressedEdwardsY);
| ^^^^^^^^^^^^^^^^^^^^ this is the expected type
|
::: /Users/master/.cargo/registry/src/index.crates.io-1949cf8c6b5b557f/iroh-base-0.96.1/src/key.rs:24:1
|
24 | pub struct PublicKey(CompressedEdwardsY);
| -------------------- this is the found type
= help: you can use `cargo tree` to explore your dependency tree
error[E0308]: mismatched types
--> iroh-docs/src/engine/gossip.rs:181:39
|
181 | ... node: msg.delivered_from,
| ^^^^^^^^^^^^^^^^^^ expected `radio::PublicKey`, found `iroh_base::key::PublicKey`
|
note: there are multiple different versions of crate `iroh_base` in the dependency graph
--> iroh-base/src/key.rs:24:1
|
24 | pub struct PublicKey(CompressedEdwardsY);
| ^^^^^^^^^^^^^^^^^^^^ this is the expected type
|
::: /Users/master/.cargo/registry/src/index.crates.io-1949cf8c6b5b557f/iroh-base-0.96.1/src/key.rs:24:1
|
24 | pub struct PublicKey(CompressedEdwardsY);
| -------------------- this is the found type
= help: you can use `cargo tree` to explore your dependency tree
error[E0308]: mismatched types
--> iroh-docs/src/engine/gossip.rs:189:39
|
189 | ... from: msg.delivered_from,
| ^^^^^^^^^^^^^^^^^^ expected `radio::PublicKey`, found `iroh_base::key::PublicKey`
|
note: there are multiple different versions of crate `iroh_base` in the dependency graph
--> iroh-base/src/key.rs:24:1
|
24 | pub struct PublicKey(CompressedEdwardsY);
| ^^^^^^^^^^^^^^^^^^^^ this is the expected type
|
::: /Users/master/.cargo/registry/src/index.crates.io-1949cf8c6b5b557f/iroh-base-0.96.1/src/key.rs:24:1
|
24 | pub struct PublicKey(CompressedEdwardsY);
| -------------------- this is the found type
= help: you can use `cargo tree` to explore your dependency tree
error[E0308]: mismatched types
--> iroh-docs/src/engine/gossip.rs:198:64
|
198 | .send(ToLiveActor::NeighborUp { namespace, peer })
| ^^^^ expected `radio::PublicKey`, found `iroh_base::key::PublicKey`
|
note: there are multiple different versions of crate `iroh_base` in the dependency graph
--> iroh-base/src/key.rs:24:1
|
24 | pub struct PublicKey(CompressedEdwardsY);
| ^^^^^^^^^^^^^^^^^^^^ this is the expected type
|
::: /Users/master/.cargo/registry/src/index.crates.io-1949cf8c6b5b557f/iroh-base-0.96.1/src/key.rs:24:1
|
24 | pub struct PublicKey(CompressedEdwardsY);
| -------------------- this is the found type
= help: you can use `cargo tree` to explore your dependency tree
error[E0308]: mismatched types
--> iroh-docs/src/engine/gossip.rs:203:66
|
203 | .send(ToLiveActor::NeighborDown { namespace, peer })
| ^^^^ expected `radio::PublicKey`, found `iroh_base::key::PublicKey`
|
note: there are multiple different versions of crate `iroh_base` in the dependency graph
--> iroh-base/src/key.rs:24:1
|
24 | pub struct PublicKey(CompressedEdwardsY);
| ^^^^^^^^^^^^^^^^^^^^ this is the expected type
|
::: /Users/master/.cargo/registry/src/index.crates.io-1949cf8c6b5b557f/iroh-base-0.96.1/src/key.rs:24:1
|
24 | pub struct PublicKey(CompressedEdwardsY);
| -------------------- this is the found type
= help: you can use `cargo tree` to explore your dependency tree
Some errors have detailed explanations: E0053, E0271, E0308.
For more information about an error, try `rustc --explain E0053`.
error: could not compile `iroh-docs` (lib) due to 9 previous errors